IEA Wind Task 32 Wind Lidar Ontology
type: ConceptScheme

Windscanner测风雷达
broader: Devices
in scheme: IEA Wind Task 32 Wind Lidar Ontology
definition: 一种激光雷达测风系统，可用于进行会聚扫描的几何形状。最初是指DTU领导的winddscanner.eu项目。 @cn
definition: Uno de los varios tipos de sistemas que se pueden utilizar para realizar escaneos de geometría convergente. Originariamente hace referencia al proyecto windscanner.eu de DTU. @es
definition: Uno dei vari tipi di sistemi che possono essere utilizzati per effettuare scansioni su geometrie convergenti. Originariamente noto come il progetto windscanner.eu project di DTU. @it
definition: One of many different types of system that can be used to perform convergent scan geometries. Originally referred to the DTU-led windscanner.eu project.
preferred label: Escáner de viento @es
preferred label: Windscanner
preferred label: Lidar 'WindScanner' @it
type: Concept

Devices
preferred label: Dispositivi lidar @it
preferred label: 设备 @cn
preferred label: Dispositivos @es
preferred label: Geräte @de
type: Concept
narrower: Windscanner测风雷达