IEA Wind Task 32 Wind Lidar Ontology
type: ConceptScheme

WindPro
broader: Halo-Photonik
in scheme: IEA Wind Task 32 Wind Lidar Ontology
definition: Perfilador vertical producido por Halo Photonics. @es
definition: HaloPhotonics公司生产的垂直剖面仪。 @cn
definition: Vertical profiler manufactured by HaloPhotonics.
definition: Lidar verticale prodotto da Halophotonics. @it
preferred label: WindMast @es
preferred label: Lidar 'WindMast' @it
type: Concept

Halo-Photonik
preferred label: Halo photonics
type: Concept
narrower: WindPro