IEA Wind Task 32 Wind Lidar Ontology
type: ConceptScheme

Lidar 'WindCube'
broader: Lidar 'WindCube'
in scheme: IEA Wind Task 32 Wind Lidar Ontology
definition: Lidar verticale prodotto da Leosphere - a Vaisala company.
definition: Perfilador vertical producido por Leosphere - a Vaisala company. @es
definition: 由维萨拉公司的Leosphere公司生产的垂直剖面仪。 @cn
definition: Vertical profiler manufactured by Leosphere - a Vaisala company. @en
preferred label: WindcubeV2 @de
preferred label: Windcube @cn
preferred label: WindCube @es
type: Concept

Lidar 'WindCube'
preferred label: Windcube @de
preferred label: WindCube @es
type: Concept
narrower: Lidar 'WindCube'