IEA Wind Task 32 Wind Lidar Ontology
type: ConceptScheme

Lidar 'WindCube Scan'
broader: Lidar 'WindCube'
in scheme: IEA Wind Task 32 Wind Lidar Ontology
definition: Lidar de largo alcance producido por Leosphere - a Vaisala company. @es
definition: 由Leosphere-维萨拉公司生产的长距离扫描激光雷达。 @cn
definition: Scanner a lungo raggio prodotto da Leosphere - a Vaisala company.
definition: Long range scannig lidar manufactured by Leosphere - a Vaisala company. @en
preferred label: WindCube Scan @cn
type: Concept

Lidar 'WindCube'
preferred label: Windcube @de
preferred label: WindCube @es
type: Concept
narrower: Lidar 'WindCube Scan'