IEA Wind Task 32 Wind Lidar Ontology
type: ConceptScheme

Wind Eagle
broader: Epsiline
in scheme: IEA Wind Task 32 Wind Lidar Ontology
definition: Lidar de góndola producido por Epsiline. @es
definition: Epsiline公司生产的机舱激光雷达。
definition: Nacelle mounted lidar manufactured by Epsiline. @en
definition: Lidar per navicella prodotto da Epsiline. @it
preferred label: Lidar 'Wind Eagle' @de
type: Concept

Epsiline
preferred label: Lidar 'Epsiline' @de
type: Concept
narrower: Wind Eagle