IEA Wind Task 32 Wind Lidar Ontology
type: ConceptScheme

Wind3D
broader: Leice
in scheme: IEA Wind Task 32 Wind Lidar Ontology
definition: Lidar de escaneo producido por Leice. @es
definition: 莱斯公司生产的扫描激光雷达。
definition: Scanning lidar manufactured by Leice. @en
definition: Scanner a lungo raggio prodotto da Leice. @it
preferred label: Lidar 'Wind3D' @it
type: Concept

Leice
preferred label: Lidar 'Leice' @de
type: Concept
narrower: Wind3D