IEA Wind Task 32 Wind Lidar Ontology
type: ConceptScheme

Velocity azimuth display
editorial note: El método VAD se describe en Lhermitte (1996) y en Browning and Wexler (1968) @es
editorial note: Il metodo VAD è descritto in Lhermitte (1966) e Bowning e Wexler (1968). @it
editorial note: The VAD method is described in Lhermitte (1966) and Browning and Wexler (1968).
alternative label: VAD
broader: Windfield Reconstruction
in scheme: IEA Wind Task 32 Wind Lidar Ontology
definition: VAD es un método de análisis de datos provenientes de un escaneo de geometría cónica en el que varios puntos azimutales estrechamente espaciados son muestreados por el lidar. Dichos datos se utilizan para estimar la velocidad del viento a una determinada altura utilizando métodos de ajuste estadísticos. @es
definition: VAD是一种测风激光雷达的测量方法，通过倒圆锥形的扫描方式，雷达可以对许多间隔很近的方位角点进行采样，然后使用统计拟合方法将数据用于推算每个高度的风速。 @cn
definition: Un particolare metodo di analisi dati di un lidar a geometria conica. Data una scansione completa del cono ad una specifica altezza, i punti di misurazione contigui l'uno all'altro nello spazio vengono combinati secondo metodi statistici di interpolazione per ricostruire la velocità del vento. @it
definition: VAD is a method of analyzing data from a complete conical scan whereby many closely spaced azimuthal points may be sampled by the lidar, and the data are used to estimate the wind speed at each height using a statistical fitting method.
preferred label: Geschwindigkeits-Azimut-Anzeige @de
preferred label: VAD测量法 @cn
preferred label: Muestreo de velocidad en azimut @es
preferred label: Campionamento di velocità in azimut @it
type: Concept

Windfield Reconstruction
preferred label: Windfeld-Rekonstruktion @de
preferred label: 气流（风）流场重构 @cn
preferred label: Reconstrucción del campo de vientos @es
preferred label: Ricostruzione del campo di vento @it
type: Concept
narrower: Velocity azimuth display