IEA Wind Task 32 Wind Lidar Ontology
type: ConceptScheme

UPS battery intensity
units: A
broader: UninterruptiblePowerSupply
in scheme: IEA Wind Task 32 Wind Lidar Ontology
definition: Lidar working current intensity provided by the UPS when working off-line.
definition: 在未接电网工作时，不间断电源提供的激光雷达工作电流强度 @cn
definition: Intensidad de la corriente de trabajo lidar proporcionada por el sistema de alimentación ininterrumpida cuando el lidar trabaja desconectado de la red eléctrica. @es
definition: Intensità della corrente elettrica provvigionata dal gruppo di continuità. @it
preferred label: USV-Batterieintensität @de
preferred label: UPS电池强度 @cn
preferred label: Intensità @it
type: Concept