IEA Wind Task 32 Wind Lidar Ontology
type: ConceptScheme

Uninterruptable power supply
broader: Power module
in scheme: IEA Wind Task 32 Wind Lidar Ontology
definition: 一个配有电池和变压器的装置，确保了持续和可靠的电力供应。这个装置保证激光雷达短暂脱离供电线后依然可以工作。 @cn
definition: A device provided with batteries and a transformer ensuring a continuous and reliable power supply. This device allows the lidar to work off-line.
definition: Sistema de alimentación ininterrumpida (SAI). @es
definition: Gruppo di continuità (UPS). @it
preferred label: Unterbrechungsfreie Stromversorgung @de
preferred label: Sistema de alimentación ininterrumpida o SAI @es
preferred label: 不间断电源(UPS) @cn
preferred label: Gruppo di continuità (UPS) @it
type: Concept

Power module
preferred label: Netzteil @de
preferred label: 电源模块 @cn
preferred label: Módulo de alimentación @es
preferred label: Componente di alimentazione @it
type: Concept
narrower: Uninterruptable power supply