IEA Wind Task 32 Wind Lidar Ontology
type: ConceptScheme

Uncertainties
broader: Outputs
in scheme: IEA Wind Task 32 Wind Lidar Ontology
definition: Errore statistico della misurazione. @it
definition: Cantidades para estimar el error estadístico de los datos de medición del lidar, que afecta a la disponibilidad de los datos del lidar, a su validez, etc. @es
definition: 测风激光雷达测量数据的统计误差的度量，会影响数据的可利用率、有效性等。 @cn
definition: Quantities to indicate the statistical error from lidar measurement data, which affects the lidar data availability, validility, etc.
preferred label: Ungewissheiten @de
preferred label: 不确定性 @cn
preferred label: Incertezze @it
type: Concept

Outputs
preferred label: Ausgaben @de
preferred label: 输出结果 @cn
preferred label: Risultati @it
type: Concept
narrower: Uncertainties