IEA Wind Task 32 Wind Lidar Ontology
type: ConceptScheme

StreamLine
broader: Halo photonics
in scheme: IEA Wind Task 32 Wind Lidar Ontology
definition: Lidar de escaneo producido por Halo Photonics. @es
definition: HaloPhotonics公司生产的扫描激光雷达。
definition: Scanning lidar manufactured by HaloPhotonics. @en
definition: Scanner a lungo raggio prodotto da HaloPhotonics. @it
preferred label: Stromlinie @de
preferred label: Lidar 'StreamLine' @it
type: Concept

Halo photonics
preferred label: Halo-Photonik @de
type: Concept
narrower: StreamLine