IEA Wind Task 32 Wind Lidar Ontology
type: ConceptScheme

Bereich
narrower: Range resolution
narrower: Focus distance
narrower: Time of flight
broader: Probe
in scheme: IEA Wind Task 32 Wind Lidar Ontology
definition: La distanza massima oltre cui la misurazione è inibita a causa di criteri sulla disponibilità di segnale (ad esemçpio, insufficiente SNR). @it
definition: Distancia máxima a partir de la cual la detección está limitada por un criterio de disponibilidad de datos, por ejemplo, la SNR. @es
definition: 探测的最大距离。超过这个距离，数据可用性会降低，例如，信噪比超出正常范围。 @cn
definition: The maximum distance beyond which detection is limited by a data availability criterion, for example, SNR.
preferred label: 探测距离 @cn
preferred label: Range
type: Concept

Range resolution
preferred label: Bereichsauflösung @de
preferred label: Resolución de distancia @es
preferred label: 探测间隔分辨率 @cn
preferred label: Risoluzione della distanza @it
type: Concept
broader: Bereich

Focus distance
preferred label: Fokus-Distanz @de
preferred label: Distanza di messa a fuoco @it
preferred label: 焦距 @cn
type: Concept
broader: Bereich

Time of flight
preferred label: Flugzeit @de
preferred label: 飞行时间 @cn
preferred label: Tiempo de vuelo @es
preferred label: Tempo di volo @it
type: Concept
broader: Bereich

Probe
preferred label: Sonde @de
preferred label: 探测 @cn
preferred label: Sonda @es
type: Concept
narrower: Bereich