IEA Wind Task 32 Wind Lidar Ontology
type: ConceptScheme

Probe volume
narrower: Beam diameter
narrower: Rayleigh length
broader: Probe
in scheme: IEA Wind Task 32 Wind Lidar Ontology
definition: 测风激光雷达测量视线方向速度所覆盖的空间范围。 @cn
definition: Volumen a lo largo del cual la sonda interactúa con la atmósfera dando como resultado la medida de la velocidad radial. @es
definition: Volume spaziale investito dalla sonda del lidar (probe). In questa regione avviene l'interazione fra il sistema lidar e l'atmosfera e da questa regione di deriva la velocità radiale del vento. @it
definition: The volume in which the probe interacts with the atmosphere resulting in the measurement of a radial velocity.
preferred label: Sondenvolumen @de
preferred label: 探测体积 @cn
preferred label: Volumen de la sonda @es
preferred label: Volume della sonda @it
type: Concept

Beam diameter
preferred label: Strahldurchmesser @de
preferred label: Diametro del fascio @it
type: Concept
broader: Probe volume

Rayleigh length
preferred label: Rayleigh Länge @de
preferred label: Lunghezza Rayleigh @it
preferred label: 瑞利长度 @cn
preferred label: Longitud Rayleigh @es
type: Concept
broader: Probe volume

Probe
preferred label: Sonde @de
preferred label: 探测 @cn
preferred label: Sonda @es
type: Concept
narrower: Probe volume