IEA Wind Task 32 Wind Lidar Ontology
type: ConceptScheme

Non-desired backscattered light
broader: Backscattered light
in scheme: IEA Wind Task 32 Wind Lidar Ontology
definition: 到达检测器的，来自大气（非偏振）的非期望光信号。 @cn
definition: Non-desired light from atmosphere (non polarised) reaching the detector.
definition: Porción de la luz que llega al detector lidar que no se debe al movimiento del viento (normalmente no polarizada). @es
definition: Porzione della luce che raggiunge il fotorivelatore non dovuta al moto ventoso (tipicamente non polarizzata). @it
preferred label: Nicht erwünschtes Rückstreulicht @de
preferred label: 非期望的后向散射光 @cn
preferred label: Luce riflessa portatrice di rumore ambientale @it
type: Concept

Backscattered light
preferred label: Rückgestreutes Licht @de
preferred label: 背向散射光 @cn
preferred label: Luce riflessa @it
type: Concept
narrower: Non-desired backscattered light