IEA Wind Task 32 Wind Lidar Ontology
type: ConceptScheme

Fast fourier transform
preferred label: FFT
broader: Frequency analyser
in scheme: IEA Wind Task 32 Wind Lidar Ontology
definition: 快速傅里叶变换。将激光雷达数据时间序列转化为其功率频谱的方法。 @cn
definition: Transformada de Fourier rápida. Método para transformar las series temporales de datos lidar en su espectro de potencias. @es
definition: Fast fourier transform. Methodology to transform the lidar data time series into their power spectra.
definition: Trasformata di Fourier rapida. Metodo per trasformare la serie temporale dei dati nel suo spettro di potenza. @it
preferred label: Schnelle Fourier-Transformation @de
preferred label: Transformada de Fourier rápida @es
type: Concept

Frequency analyser
preferred label: Frequenz-Analysator @de
preferred label: 频率分析器 @cn
preferred label: Analizzatore della frequenza @it
preferred label: Analizador de frecuencia @es
type: Concept
narrower: Fast fourier transform