IEA Wind Task 32 Wind Lidar Ontology
type: ConceptScheme

Cross-correlation
broader: Wind speed evaluation
in scheme: IEA Wind Task 32 Wind Lidar Ontology
definition: Metodo per calcolare la turbolenza con metodi prettamente statistici . @it
definition: 一种气流流场模型：交叉相关作为一个术语，用统计学描述流场中的湍流情况 @cn
definition: Cross-correlation as a method to describe turbulence in the field using statistics.
definition: Correlación cruzada como método para describir la turbulencia en el campo utilizando la estadística. @es
preferred label: Kreuzkorrelation @de
preferred label: 交叉相关 @cn
preferred label: Correlazione incrociata @it
type: Concept

Wind speed evaluation
preferred label: Windgeschwindigkeitsevaluation @de
preferred label: 风速评估 @cn
preferred label: Valutazione della velocità del vento @it
type: Concept
narrower: Cross-correlation