IEA Wind Task 32 Wind Lidar Ontology
type: ConceptScheme

ZXTM
type: Concept
broader: Zephir
in scheme: IEA Wind Task 32 Wind Lidar Ontology
definition: Lidar de góndola producido por ZX lidars. @es
definition: 由ZX激光雷达公司制造的机舱安装激光雷达。
definition: Nacelle mounted lidar manufactured by ZX lidars. @en
definition: Lidar per navicella prodotto da ZX lidars. @it
preferred label: Lidar 'ZXTM' @it

Zephir
type: Concept
preferred label: Lidar 'Zephir' @it
narrower: ZXTM