IEA Wind Task 32 Wind Lidar Ontology
type: ConceptScheme

Lidar 'WindCube'
type: Concept
narrower: Lidar 'WindCube'
narrower: Lidar 'WindCube Scan'
narrower: Lidar 'WindCube Nacelle'
broader: Dispositivi lidar
in scheme: IEA Wind Task 32 Wind Lidar Ontology
definition: Familia de lidares de viento producidos por Leosphere - a Vaisala company. Véase: https://www.vaisala.com/en/wind-lidars/wind-energy @es
definition: Leosphere--Vaisala公司生产的风速仪系列。请参考https://www.vaisala.com/en/wind-lidars/wind-energy。 @cn
definition: Family of wind lidars produced by Leosphere - a Vaisala company. Please refer to https://www.vaisala.com/en/wind-lidars/wind-energy. @en
definition: Famiglia di lidars prodotti da Leosphere - a Vaisala company. Per maggiori informazioni, visitare https://www.vaisala.com/en/wind-lidars/wind-energy.
preferred label: Windcube @de
preferred label: WindCube @es

Lidar 'WindCube'
type: Concept
preferred label: WindcubeV2 @de
preferred label: Windcube @cn
preferred label: WindCube @es
broader: Lidar 'WindCube'

Lidar 'WindCube Scan'
type: Concept
preferred label: WindCube Scan @cn
broader: Lidar 'WindCube'

Lidar 'WindCube Nacelle'
type: Concept
preferred label: WindCube Nacelle @cn
broader: Lidar 'WindCube'

Dispositivi lidar
type: Concept
preferred label: 设备 @cn
preferred label: Dispositivos @es
preferred label: Geräte @de
preferred label: Devices @en
narrower: Lidar 'WindCube'