IEA Wind Task 32 Wind Lidar Ontology
type: ConceptScheme

Wind velocity
type: Concept
alternative label: Wind speed
broader: Outputs
in scheme: IEA Wind Task 32 Wind Lidar Ontology
definition: Vettore della velocita' del vento, dato dalla combinazione di velocita assoluta e direzione. @it
definition: El vector de velocidad del viento está formado por la velocidad y la dirección del viento para un momento dado. @es
definition: The wind velocity vector consist of wind speed and wind direction in a given time.
definition: 给定时间内的风速和风向 @cn
preferred label: Windgeschwindigkeit @de
preferred label: 风速 @cn
preferred label: Velocità del vento @it

Outputs
type: Concept
preferred label: Ausgaben @de
preferred label: 输出结果 @cn
preferred label: Risultati @it
narrower: Wind velocity