IEA Wind Task 32 Wind Lidar Ontology
type: ConceptScheme

Wind plant control
type: Concept
broader: Use case
in scheme: IEA Wind Task 32 Wind Lidar Ontology
definition: Estrategias basadas en información lidar para el control colectivo de turbinas eólicas en un mismo parque eólico. @es
definition: 基于激光雷达，对于同一个风电场内的风力发电机组进行集体控制的技术。 @cn
definition: Tecniche di controllo collettivo di turbine eoliche nello stesso parco basate su misurazioni da lidar. @it
definition: Lidar based strategies for collective control of wind generators in the same park.
preferred label: Steuerung von Windkraftanlagen @de
preferred label: 风电场控制 @cn
preferred label: Controllo del parco eolico @it
preferred label: Control de parque eólico @es

Use case
type: Concept
preferred label: Anwendungsfall @de
preferred label: 应用场景 @cn
preferred label: Caso de uso @es
preferred label: Casi di uso @it
narrower: Wind plant control