IEA Wind Task 32 Wind Lidar Ontology
type: ConceptScheme

Turbine certification
type: Concept
broader: Use case
in scheme: IEA Wind Task 32 Wind Lidar Ontology
definition: Proceso mediante el que se definen los niveles de garantía de calidad y tipo de elemento para generadores eólicos. Es un requerimiento para la comercialización de turbinas eólicas. @es
definition: 旨在验证风力发电机的设计、测试和制造符合规定的风力等级，并符合国际认证标准以及所有其他适用的标准和法规要求，是风力发电机组商业化的前提。 @cn
definition: Processo di definizione dei livelli di garanzia e classe di operatività per generatori eolici. E' necessario per la commercializzazione delle turbine. @it
definition: Process of definition of the levels of quality warranty and object class for wind turbine generators. It is required for turbines' commercialization.
preferred label: Zertifizierung von Turbinen @de
preferred label: 风力发电机组认证 @cn
preferred label: Certificazione per turbine eoliche @it
preferred label: Certificación de la turbina eólica @es

Use case
type: Concept
preferred label: Anwendungsfall @de
preferred label: 应用场景 @cn
preferred label: Caso de uso @es
preferred label: Casi di uso @it
narrower: Turbine certification