IEA Wind Task 32 Wind Lidar Ontology
type: ConceptScheme

Simple flow
type: Concept
alternative label: Simple Flow
broader: Wind turbine model
in scheme: IEA Wind Task 32 Wind Lidar Ontology
definition: Flujo de viento definido como horizontal homogéneo, sin turbulencia o turbulencia despreciable que se suele utilizar para los modelos de campo de viento en terreno plano o en alta mar. @es
definition: 水平方向均质的气流，不含有湍流或只含有可以忽略的小湍流，该气流（风）流场模型通常适用于平坦地形或海上。 @cn
definition: Horizontal-homogeneous wind flow, no turbulence or little turbulence that can be neglected, which is usually used for wind field models in flat terrain or offshore.
definition: Flusso ventoso in assenza di turbolenza o in presenza di debole turbolenza. E' solitamente utilizzato per modelli di vento in terreno piatto o offshore. @it
preferred label: 简单气流 @cn
preferred label: flujo sencillo @es
preferred label: Flusso semplice @it
preferred label: Einfacher Ablauf @de

Wind turbine model
type: Concept
preferred label: 风力发电机组模型 @cn
preferred label: Modelo de aerogenerador @es
preferred label: Modello di turbina eolica @it
preferred label: Modell einer Windkraftanlage @de
narrower: Simple flow