IEA Wind Task 32 Wind Lidar Ontology
type: ConceptScheme

Raw data
type: Concept
broader: Filtering strategy
in scheme: IEA Wind Task 32 Wind Lidar Ontology
definition: Salida de datos del convertidor analógico-digital (ADC ) del lidar, previo a la aplicación de cualquier algoritmo de filtrado o post-procesamiento. @es
definition: 从激光雷达DSP输出，未经过任何数据过滤和后处理的数据 @cn
definition: Data output from the lidar ADC(Analog Digital Converter), before any filtering and post-processing algorithm.
definition: Dati in uscita dalla DSP del lidar, prima di qualsiasi filtraggio ed algoritmo di post-processamento. @it
preferred label: Rohdaten @de
preferred label: 原始数据 @cn
preferred label: RawData @it

Filtering strategy
type: Concept
preferred label: Filterstrategie @de
preferred label: 数据过滤方法 @cn
preferred label: Strategia di filtraggio dati @it
narrower: Raw data