IEA Wind Task 32 Wind Lidar Ontology
type: ConceptScheme

Range resolution
type: Concept
broader: Bereich
in scheme: IEA Wind Task 32 Wind Lidar Ontology
definition: Distancia que puede ser resuelta por la longitud del pulso láser. Viene dada por la relación entre la velocidad de la luz y la mitad de la duración del pulso. @es
definition: 探测间隔分辨率是激光脉冲波所覆盖的距离。数值上等于光速乘以脉冲持续时间除以二。 @cn
definition: The range resolution is the distance that can be resolved by the laser pulse length. This is given by (half) the speed of light multiplied by the pulse duration.
definition: La distanza che può essere risolta dalla lunghezza dell'impulso laser. E' data dalla metà del prodotto fra la velocità della luce e la durata dall'impulso. @it
preferred label: Bereichsauflösung @de
preferred label: Resolución de distancia @es
preferred label: 探测间隔分辨率 @cn
preferred label: Risoluzione della distanza @it

Bereich
type: Concept
preferred label: 探测距离 @cn
preferred label: Range
narrower: Range resolution