IEA Wind Task 32 Wind Lidar Ontology
type: ConceptScheme

Processed data
type: Concept
broader: Filtering strategy
in scheme: IEA Wind Task 32 Wind Lidar Ontology
definition: Datos generados tras el procesamiento de los datos pre-procesados mediante métodos especiales de filtrado u otros, en función del propósito. @es
definition: Dati prodotti per applicazione di filtri sui dati pre-processati. @it
definition: 用因地（时）制宜的方法处理后的数据，以获得最终更可靠的数据集。例如，用特殊的方法对光束击中波浪时的数据进行过滤。 @cn
definition: Data that generated after processing the pre-processed data by special or case-dependent filtering methods. e.g. Filtering of data for the period when the lidar beam hits the wave.
preferred label: Verarbeitete Daten @de
preferred label: 已处理的数据 @cn
preferred label: Dati post-processati @it

Filtering strategy
type: Concept
preferred label: Filterstrategie @de
preferred label: 数据过滤方法 @cn
preferred label: Strategia di filtraggio dati @it
narrower: Processed data