IEA Wind Task 32 Wind Lidar Ontology
type: ConceptScheme

性能测试
type: Concept
narrower: IEC标准61400-50-3
narrower: IEC标准61400-50-2
narrower: Task32 推荐做法
broader: 应用场景
in scheme: IEA Wind Task 32 Wind Lidar Ontology
definition: Proceso mediante el que se verifica el rendimiento de la turbina eólica en cuanto a la producción de potencia, normalmente en función de las garantías emitidas por el fabricante. @es
definition: 测试风力发电机组性能（功率特性）的过程，通常是为了验证风电机组的实际运行性能与制造商设定性能之间的差异
definition: Processo di verifica delle prestazioni di produzione delle turbine. Il riferimento sono le garanzie rilasciate dal costruttore delle turbine. @it
definition: Process of verification of turbines' power production performances, typically against the warranties issued by the turbine manufacturer. @en
preferred label: Leistungsüberprüfung @de
preferred label: Verifica delle performances @it
preferred label: Verificación del rendimiento @es
preferred label: Performance verification @en

IEC标准61400-50-3
type: Concept
preferred label: IEC-Norm 61400-50-3 @de
preferred label: Norma IEC 61400-50-3 @es
preferred label: IEC Standard 61400-50-3 @it
broader: 性能测试

IEC标准61400-50-2
type: Concept
preferred label: IEC-Norm 61400-50-2 @de
preferred label: Norma IEC 61400-50-2 @es
preferred label: IEC Standard 61400-50-2 @it
broader: 性能测试

Task32 推荐做法
type: Concept
preferred label: Task32 Empfohlene Vorgehensweisen @de
preferred label: Raccomandazioni della IEA Task32 @it
preferred label: Task32 Recommended practices @en
preferred label: Recomendaciones Task32 @es
broader: 性能测试

应用场景
type: Concept
preferred label: Anwendungsfall @de
preferred label: Caso de uso @es
preferred label: Casi di uso @it
preferred label: Use case @en
narrower: 性能测试