IEA Wind Task 32 Wind Lidar Ontology
type: ConceptScheme

Motion compensation
type: Concept
broader: Wind field model
in scheme: IEA Wind Task 32 Wind Lidar Ontology
definition: The methods that correct the reconstructed wind field with motion information from lidar or other inertial measurement units, typically for floating lidars or lidars mounted on a floating platform or vessel.
definition: Métodos de corrección de datos lidar durante el proceso de reconstrucción del campo de vientos. Para la corrección se incluyen datos sobre el movimiento del lidar registrados mediante el propio lidar u otras unidades de medición inercial. Típicamente utilizado para lidares flotantes u otras plataformas móviles como barcos. @es
definition: 用传感器测的的激光雷达运动信息修正或重构气流（风）流场的方法，通常用于漂浮式激光雷达或安装在浮动平台或船上的激光雷达 @cn
definition: Metodo di correzione dei dati registrati dal lidar per il moto della sorgente di luce stessa o del supporto dove essa si situa. Algoritmi cruciali per floating lidars o lidars montati su piattaforme mobili. @it
preferred label: 运动补偿 @cn
preferred label: Compensazione del movimento @it
preferred label: Compensación de movimiento @es
preferred label: Bewegungskompensation @de

Wind field model
type: Concept
preferred label: Windfeld-Modell @de
preferred label: 气流（风）流场模型 @cn
preferred label: Modelo de campo de viento @es
preferred label: Modello di campo eolico @it
narrower: Motion compensation