IEA Wind Task 32 Wind Lidar Ontology
type: ConceptScheme

Molas NL
type: Concept
broader: MoveLaser
in scheme: IEA Wind Task 32 Wind Lidar Ontology
definition: Lidar de góndola producido por Nanjing MoveLaser. @es
definition: 南京MoveLaser公司生产的机舱式激光雷达。 @cn
definition: Nacelle mounted lidar manufactured by Nanjing MoveLaser.
definition: Lidar per navicella prodotto da Nanjing MoveLaser. @it
preferred label: Lidar 'Molas NL' @it