IEA Wind Task 32 Wind Lidar Ontology
type: ConceptScheme

Metmast performance verification
type: Concept
broader: Use case
in scheme: IEA Wind Task 32 Wind Lidar Ontology
definition: Lidar based measurements to verify the quality of measurments from met mast instrumentations.
definition: Medidas lidar para veificar la calidad de medidas tomadas por sensores montados sobre una torre meteorológica. @es
definition: 基于激光雷达的测量，以验证测风塔上测风仪器的测量质量。 @cn
definition: Misurazioni lidar volte a verificare la qualità delle misurazioni effettuate da anemometri posizionati su torri meteorologiche. @it
preferred label: Verifizierung der Metmast-Leistung @de
preferred label: 测风塔性能验证 @cn
preferred label: Verifica delle torri anemometriche @it
preferred label: Verificación del rendimiento de la torre meteorológica @es

Use case
type: Concept
preferred label: Anwendungsfall @de
preferred label: 应用场景 @cn
preferred label: Caso de uso @es
preferred label: Casi di uso @it
narrower: Metmast performance verification