IEA Wind Task 32 Wind Lidar Ontology
type: ConceptScheme

Logging frequency
type: Concept
units: Hz
broader: Data communication
in scheme: IEA Wind Task 32 Wind Lidar Ontology
definition: Frequenza massima di scrittura dei logs di un lidar. @it
definition: Maximale Aufzeichnungsfrequenz des Lidar-Messgerätes. @de
definition: 记录器或激光雷达的最大记录频率 @cn
definition: Maximum logging frequency of the logger or the Lidar measurement device.
definition: Frecuencia máxima de registro del dispositivo de medición lidar. @es
preferred label: Häufigkeit der Protokollierung @de
preferred label: 记录频率 @cn
preferred label: Frequenza di registrazione @it

Data communication
type: Concept
preferred label: Datenübertragung @de
preferred label: 数据通信 @cn
preferred label: Comunicazione dati @it
narrower: Logging frequency