IEA Wind Task 32 Wind Lidar Ontology
type: ConceptScheme

Incoherent
type: Concept
alternative label: Direct
broader: Detection type
in scheme: IEA Wind Task 32 Wind Lidar Ontology
definition: 一种激光雷达系统，其中返回信号被过滤或分解成其光谱成分以获得频移。也被称为飞行时间激光雷达或直接探测激光雷达。 @cn
definition: Sistema lidar donde la señal de retorno se filtra o se resuelve en sus componentes espectrales para obtener el cambio de frecuencia. También conocido como lidar de tiempo de vuelo o lidar de detección directa. @es
definition: Un sistema lidar in cui il segnale di ritorno viene filtrato o risolto nelle sue componenti spettrali per ottenere lo spostamento di frequenza. Conosciuto anche come lidar del tempo di volo o lidar a rilevamento diretto. @it
definition: Ein Lidar-System, bei dem das Rücksignal gefiltert oder in seine Spektralkomponenten aufgelöst wird, um die Frequenzverschiebung zu erhalten. Auch bekannt als Time-of-Flight-Lidar oder Direkterkennungs-Lidar. @de
definition: A lidar system where the return signal is filtered or resolved into its spectral components to obtain the frequency shift. Also known as time-of-flight lidar or direct-detection lidar.
preferred label: Inkohärent @de
preferred label: 非相干 @cn
preferred label: Incoerente @it

Detection type
type: Concept
preferred label: Art der Erkennung @de
preferred label: 检测类型 @cn
preferred label: Tipo di rilevamento @it
narrower: Incoherent