IEA Wind Task 32 Wind Lidar Ontology
type: ConceptScheme

Focus distance
type: Concept
broader: Bereich
in scheme: IEA Wind Task 32 Wind Lidar Ontology
definition: The distance from the lidar to the telescope focal length. Ideally coincides with the laser beam waist.
definition: Distancia desde el lidar hasta la distancia focal del telescopio. Idealmente coincide con el punto de convergencia máxima de luz del rayo. @es
definition: 从测风激光雷达到激光束汇聚点的距离，由望远镜的焦距规定。 @cn
definition: La distanza fra il centro della lente ottica e il suo fuoco. @it
preferred label: Fokus-Distanz @de
preferred label: Distanza di messa a fuoco @it
preferred label: 焦距 @cn

Bereich
type: Concept
preferred label: 探测距离 @cn
preferred label: Range
narrower: Focus distance