IEA Wind Task 32 Wind Lidar Ontology
type: ConceptScheme

Emitter/receiver configuration
type: Concept
editorial note: Puede ser monoestático (con una configuración coaxial o biaxial) o biestático. @es
editorial note: This can be monostatic (with biaxial or a coaxial sensor arrangement) or bistatic
broader: Measurement principles
in scheme: IEA Wind Task 32 Wind Lidar Ontology
definition: 发射器和接收器在雷达中的安装和配置。 @cn
definition: The positioning and arrangement of the emitter and receiver devices.
definition: Il posizionamento e la disposizione dei dispositivi emettitore e ricevitore. @it
definition: El posicionamiento y disposición de los dispositivos emisores y receptores. @es
definition: Die Positionierung und Anordnung der Sende- und Empfangsgeräte. @de
preferred label: Sender-/Empfängerkonfiguration @de
preferred label: 发射器/接收器配置 @cn
preferred label: Configurazione dell'emettitore/ricevitore @it

Measurement principles
type: Concept
preferred label: Messprinzipien @de
preferred label: 测量原则 @cn
preferred label: Principios de medición @es
preferred label: Principi di misurazione @it
narrower: Emitter/receiver configuration