IEA Wind Task 32 Wind Lidar Ontology
type: ConceptScheme

Elevation slew rate
type: Concept
units: degrees per second
broader: Scanner elevation positioning servo
in scheme: IEA Wind Task 32 Wind Lidar Ontology
definition: 伺服电机在仰角方向的最大运行速率 @cn
definition: Velocidad máxima de funcionamiento del servomotor en la dirección de elevación. @es
definition: Massima velocità di modifica dell'altezza del fascio laser. @it
definition: The maximum rate of operation of the servo motor in the elevation direction.
preferred label: Höhenanstiegsrate @de
preferred label: 仰角回转率 @cn
preferred label: Velocidad de giro de elevación @es
preferred label: Velocità massima di elevazione @it

Scanner elevation positioning servo
type: Concept
preferred label: Scanner Höhenpositionierungsservo @de
preferred label: 扫描仪仰角定位伺服 @cn
preferred label: Servomotor del posicionamiento de elevación del escáner @es
preferred label: Servomotore per la scansione nella direzione di elevazione @it
narrower: Elevation slew rate