IEA Wind Task 32 Wind Lidar Ontology
type: ConceptScheme

Doppler peak
type: Concept
broader: Doppler Spectra
in scheme: IEA Wind Task 32 Wind Lidar Ontology
definition: Pico Doppler como método para describir la amplitud de la velocidad del viento asumiendo que los aerosoles se desplazan a la misma velocidad que el viento. @es
definition: Doppler peak as a method to describe the amplitude of the wind speed asumming that the aerosols flow at the same speed as the wind.

Doppler Spectra
type: Concept
preferred label: Doppler-Spektrum @de
preferred label: Spettri Doppler @it
preferred label: Espectro Doppler @es
preferred label: 多普勒光谱 @cn
narrower: Doppler peak