IEA Wind Task 32 Wind Lidar Ontology
type: ConceptScheme

Deployment
type: Concept
units: DateTime, GPS coordinates
broader: Installation
in scheme: IEA Wind Task 32 Wind Lidar Ontology
definition: Data, luogo e posizione della messa in opera di un lidar. @it
definition: Datum, Uhrzeit und Ort der Bereitstellung @de
definition: 部署日期和时间，位置（gps） @cn
definition: Deployment date and time, location (gps).
definition: Fecha y hora de instalación, ubicación (gps). @es
preferred label: Einsatz @de
preferred label: 部署 @cn
preferred label: Messa in opera @it

Installation
type: Concept
preferred label: 安装 @cn
preferred label: Installazione @it
narrower: Deployment