IEA Wind Task 32 Wind Lidar Ontology
type: ConceptScheme

Datum plane
type: Concept
alternative label: Reference height
broader: Measurement height
in scheme: IEA Wind Task 32 Wind Lidar Ontology
definition: 各种测量高度的参考水平面，例如激光雷达窗口、本地地面、平台顶面或其他高度值的参考。 @cn
definition: Plano horizontal desde el que se definen la alrura de referencia. Típicamente ventana del lidar, plano local de tierra, parte superior de una plataforma u otra referencia. @es
definition: Piano orizzontale di riferimento per la misurazione delle altezze locali. Tipicamente la finestra del lidar, il piano terra locale, la parte superiore di una piattaforma o un qualsiasi altro riferimento. @it
definition: The horizontal plane from which the measurement height is defined, e.g., lidar window, local ground, a platform top surface, or other reference.
preferred label: 基准面 @cn
preferred label: Plano de referencia @es
preferred label: Piano di riferimento @it

Measurement height
type: Concept
preferred label: Messhöhe @de
preferred label: 测量高度 @cn
preferred label: Altura de medición @es
preferred label: Altezza di misurazione @it
narrower: Datum plane