IEA Wind Task 32 Wind Lidar Ontology
type: ConceptScheme

Data averaging period
type: Concept
units: seconds
broader: Data communication
in scheme: IEA Wind Task 32 Wind Lidar Ontology
definition: Periodo temporale di media delle misurazioni grezze. @it
definition: Die Mittelungszeit der Daten, z.B. für 20 Hz gemittelt als 10 min Daten. @de
definition: 计算均值所设定的周期，例如，用20赫兹的数据计算出10分钟平均的数据，10分钟就是数据均值周期 @cn
definition: Periodo de promediación de los datos, por ejemplo, los datos de 20 Hz se pueden promediar a datos de 10 minutos. @es
definition: Data averaging period for the data, e.g., 20 Hz data can be averaged to 10 min data.
preferred label: Zeitraum der Datenmittelung @de
preferred label: 数据均值周期 @cn
preferred label: Durata del periodo di media @it

Data communication
type: Concept
preferred label: Datenübertragung @de
preferred label: 数据通信 @cn
preferred label: Comunicazione dati @it
narrower: Data averaging period