IEA Wind Task 32 Wind Lidar Ontology
type: ConceptScheme

Cone sector
type: Concept
editorial note: La velocidad y dirección del viento puedens ser obtenidos mediante un proceso de reconstrucción del campo de vientos, asumiendo por ejemplo una dependencia senoidal con el ángulo azimutal. @es
editorial note: Wind speed and direction values can be obtained through a wind field reconstruction process, for example by assuming a sinusoidal dependence on azimuth angle.
alternative label: Plan-position indicator
alternative label: PPI
broader: Variable azimuth scan
in scheme: IEA Wind Task 32 Wind Lidar Ontology
definition: 一种扫描方式，其中光束的方位角在小于360 度范围内变化。风速和风向值可以通过气流流场重建推算获得，例如通过假定计算值（风速，风向）与方位角存在正弦函数关系。 @cn
definition: A scan geometry in which the azimuth angle of the beam is varied in increments over less than the full 360 degree range of possible azimuth angles.
definition: Geometría de escaneo en la cual el ángulo de escaneo azimutal se varía a lo largo de un intervalo inferior a 360 grados. Los valores de velocidad y dirección del viento se pueden obertener a través de un proceso de reconstrucción del campo de viento asumiendo, por ejemplo, una dependencia sinusoidal de la velocidad radial con el ángulo azimutal. @es
definition: Una geometria di scansione dello spazio in cui il fascio laser è mosso lungo una porzione dell'intervallo di 360 gradi dell'angolo azimutale. La velocità e la direzione del vento possono essere ottenute attraverso un processo di ricostruzione del campo ventoso che assume, per esempio, una dipendenza sinusoidale della velocità radiale dall'angolo di azimuth. @it
preferred label: Kegel-Sektor @de
preferred label: 锥体扇形扫描法 @cn
preferred label: Geometría de cono sectorial @es
preferred label: Geometria a settore di cono @it

Variable azimuth scan
type: Concept
preferred label: Variabler Azimut-Scan @de
preferred label: 变方位扫描法 @cn
preferred label: Escaneo de azimut variable @es
preferred label: Scansione ad azimut variabile @it
narrower: Cone sector