IEA Wind Task 32 Wind Lidar Ontology
type: ConceptScheme

Compound scan
type: Concept
narrower: Sequential scan
broader: Single lidar
in scheme: IEA Wind Task 32 Wind Lidar Ontology
definition: Compound scans include more degrees of freedom and are typically made up of a sequence of simple scans.
definition: 复合扫描包括更多的自由度，通常由一系列简单的扫描方法组成 @cn
definition: Una scansione composita include più gradi di libertà ed è tipicamente il risultato di una combinazione di più sequenze di scansioni semplici. @it
definition: Los escaneos compuestos incluyen más grados de libertad y suelen estar formados por una secuencia de escaneos simples. @es
preferred label: Zusammengesetzter Scan @de
preferred label: 复合扫描扫描法 @cn
preferred label: Scansione composita @it
preferred label: Escaneo compuesto @es

Sequential scan
type: Concept
preferred label: Sequenzieller Scan @de
preferred label: 顺序扫描扫描法 @cn
preferred label: Escaneo secuencial @es
preferred label: Scansione sequenziale @it
broader: Compound scan

Single lidar
type: Concept
preferred label: Einzelnes Lidar @de
preferred label: 单个激光雷达 @cn
preferred label: Lidar individual @es
preferred label: Lidar singolo @it
narrower: Compound scan