IEA Wind Task 32 Wind Lidar Ontology
type: ConceptScheme

Communications module
type: Concept
editorial note: Definición basada en el proyecto OpenLidar:https://github.com/e-WindLidar/OpenLidarModuleDefinitionss @es
editorial note: Definizione basata sulla definizione di modulo del progetto OpenLidar. Vedasi https://github.com/e-WindLidar/OpenLidarModuleDefinitions @it
editorial note: Definition based on the OpenLidar module definitions at https://github.com/e-WindLidar/OpenLidarModuleDefinitions
broader: Control module
in scheme: IEA Wind Task 32 Wind Lidar Ontology
definition: The system of devices and software that transmit and receive data and commands to and from the lidar device.
definition: 向激光雷达设备发送和接收数据和命令的设备和软件系统 @cn
definition: Sistema de dispositivos y software que transmite y recibe datos. @es
definition: Modulo (composto da parti hardware e software) che trasmette e riceve dati e comandi, da e per il sistema lidar. @it
preferred label: Kommunikations-Modul @de
preferred label: 通讯模块 @cn
preferred label: Componentes de comunicación @es
preferred label: Componente di comunicazione @it

Control module
type: Concept
preferred label: Steuermodul @de
preferred label: 控制模块 @cn
preferred label: Módulo de control @es
preferred label: Componente di controllo @it
narrower: Communications module