IEA Wind Task 32 Wind Lidar Ontology
type: ConceptScheme

Chassis module
type: Concept
editorial note: Definición basada en el proyecto OpenLidar: https://github.com/e-WindLidar/OpenLidarModuleDefinitions @es
editorial note: Definizione basata sulla definizione di modulo del progetto OpenLidar. Vedasi https://github.com/e-WindLidar/OpenLidarModuleDefinitions @it
editorial note: Definition based on the OpenLidar module definitions at https://github.com/e-WindLidar/OpenLidarModuleDefinitions
narrower: Environmental conditions detection
broader: Design
in scheme: IEA Wind Task 32 Wind Lidar Ontology
definition: 激光雷达的主要结构，旨在保护和容纳不同的激光雷达组件。其设计可能因激光雷达安装解决方案而异，包括但不限于安装在机舱、气象塔、地面、浮动平台或其他移动结构上。 @cn
definition: Refers to the main lidar structure, designed to protect and house the different lidar components. Its design may vary depending on lidar mounting solutions, including, but not limited to, mounting on a nacelle, a meteorological tower, the ground, a floating platform or a mobile structure.
definition: El módulo que representa el chásis representa las diversas soluciones de montaje del lidar, incluyendo (pero sin estar limitado a) montaje sobre góndola, torre meteorológica, sobre suelo, plataforma flotante o estructua móvil. @es
definition: Modulo di ancoraggio del sistema lidar per ognuna delle sue possibili applicazioni. Include, ma non si limita alle varie soluzioni di montaggio sulla navicella di una turbina, su una torre metereologica, a terra, su una piattaforma flottante o su una struttura mobile. @it
preferred label: Chassis-Modul @de
preferred label: 底盘模块 @cn
preferred label: Módulo de chasis @es
preferred label: Telaio @it

Environmental conditions detection
type: Concept
preferred label: Erkennung von Umgebungsbedingungen @de
preferred label: 环境条件检测 @cn
preferred label: Rilevamento delle condizioni ambientali @it
preferred label: Detección de condiciones medioambientales @es
broader: Chassis module

Design
type: Concept
preferred label: Entwurf @de
preferred label: 设计 @cn
preferred label: Diseño @es
preferred label: Struttura generale @it
narrower: Chassis module