IEA Wind Task 32 Wind Lidar Ontology
type: ConceptScheme

Arbitrary trajectory
type: Concept
broader: Single lidar
in scheme: IEA Wind Task 32 Wind Lidar Ontology
definition: 一种测风激光雷达的扫描方法，可以通过仰角和方位角的任意组合，跟踪所需轨迹进行扫描。比如：站在一个固定位置跟踪飞鸟的路径。 @cn
definition: Se pueden realizar escaneos en los que el haz realiza un barrido variando arbitrariamente los ángulos de elevación y acimut para seguir una trayectoria determinada. Esto podría considerarse análogo al seguimiento de la trayectoria de un pájaro en vuelo desde una ubicación fija. @es
definition: Una geometria di misurazione dove il fascio laser è mosso lungo una combinazione arbitraria di angoli di elevazione e azimutali per seguire una specifica traiettoria spaziale. Questo è del tutto analogo ad una situazione in cui si volesse descrivere in termini geometrici il volo di un uccello utilizzando un punto di riferimento fisso. @it
definition: Scans can be made where the beam is swept through an arbitrary combination of elevation and azimuth angles to follow a desired trajectory. This could be considered analagous to tracking the path of a flying bird from a fixed location.
preferred label: Willkürliche Flugbahn @de
preferred label: 任意运动轨迹扫描法 @cn
preferred label: Trayectoria arbitraria @es
preferred label: Traiettoria arbitraria @it

Single lidar
type: Concept
preferred label: Einzelnes Lidar @de
preferred label: 单个激光雷达 @cn
preferred label: Lidar individual @es
preferred label: Lidar singolo @it
narrower: Arbitrary trajectory