IEA Wind Task 32 Wind Lidar Ontology
type: ConceptScheme

Analog to digital converter
type: Concept
alternative label: ADC
narrower: Number of bits
broader: Signal processing module
in scheme: IEA Wind Task 32 Wind Lidar Ontology
definition: 将光电探测器的模拟信号转换为数字信号的装置，以便由频率分析器进行合理地分析 @cn
definition: Dispositivo que convierte la señal analógica proveniente del fotodetector en una señal digital, con lo que puede ser analizada adecuadamente por el analizador de frecuencias. @es
definition: Device that converts the analog signal from the photodetector into a digital signal to properly be analised by the frequency analyser.
definition: Convertitore del segnale analogico del fotodetettore in segnale digitale per l'analizzatore di frequenza. @it
preferred label: Analog-Digital-Wandler @de
preferred label: 模拟数字转换器 @cn
preferred label: Convertitore analogico-digitale @it
preferred label: Convertidor analógico-digital @es

Number of bits
type: Concept
preferred label: Anzahl der Bits @de
preferred label: 比特数 @cn
preferred label: Numero di bit @it
broader: Analog to digital converter

Signal processing module
type: Concept
preferred label: Modul zur Signalverarbeitung @de
preferred label: 信号处理模块 @cn
preferred label: Módulo de procesamiento de señal @es
preferred label: Componente di processamento dati @it
narrower: Analog to digital converter