IEA Wind Task 32 Wind Lidar Ontology
type: ConceptScheme

Data formats
type: Concept
narrower: ZX
preferred label: Datenformate @de
preferred label: Formato dei dati @it
preferred label: 数据格式 @cn

ZX
type: Concept
broader: Data formats
definition: Übliches Datenformat für Produkte des Herstellers ZX lidars (.zph Dateiendung). @de
definition: Formato de datos común para productos de la compañía Leosphere. @es
definition: ZX激光雷达公司产品的通用数据格式（.zph扩展）。 @cn
definition: Formato dati comune per i prodotti dell'azienda ZX lidars (estensione .zph). @it
definition: Common data format for the products of the company ZX lidars (.zph extension).
in scheme: IEA Wind Task 32 Wind Lidar Ontology