IEA Wind Task 32 Wind Lidar Ontology
type: ConceptScheme

Wakes (control of)
type: Concept
broader: Wind turbine control
definition: Lidar based techniques to control the wakes from turbines.
definition: Técnicas basadas en datos lidar para el control de estelas creadas por la turbina eólica. @es
definition: 基于激光雷达来控制风力发电机组尾流的技术。 @cn
definition: Tecniche di controllo delle scie di una turbina eolica basate su misurazioni da lidar. @it
in scheme: IEA Wind Task 32 Wind Lidar Ontology
preferred label: Wakes (Steuerung von) @de
preferred label: 尾流（控制） @cn
preferred label: Scie (controllo delle) @it
preferred label: Estelas @es

Wind turbine control
type: Concept
narrower: Wakes (control of)
preferred label: Steuerung von Windkraftanlagen @de
preferred label: 风力发电机组控制 @cn
preferred label: Controllo dei generatori eolici @it
preferred label: Técnicas de control de la turbina eólica @es