IEA Wind Task 32 Wind Lidar Ontology
type: ConceptScheme

Outputs
type: Concept
narrower: Turbulence intensity
preferred label: Ausgaben @de
preferred label: 输出结果 @cn
preferred label: Risultati @it

Turbulence intensity
type: Concept
broader: Outputs
definition: Rapporto dra la deviazione standard e valor medio della velocita' del vento, misurati su un certo intervallo temporale (solitamente 10 o 60 minuti). @it
definition: Relación entre la desviación estándar de la velocidad del viento y la velocidad media del viento, determinada a partir del mismo conjunto de muestras de datos de viento observado, y tomados durante un periodo de tiempo específico, normalmente 10min o 60min. @es
definition: 指定时间段内，风速标准偏差与平均风速的比率，由同一组风速测量数据样本确定，通常为10分钟或60分钟。 @cn
definition: Ratio of the wind speed standard deviation to the mean wind speed, determined from the same set of measured data samples of wind speed, and taken over a specified period of time, typically 10min or 60min.
in scheme: IEA Wind Task 32 Wind Lidar Ontology
preferred label: Turbulenzintensität @de
preferred label: 湍流强度 @cn
preferred label: Intensità della turbolenza @it