IEA Wind Task 32 Wind Lidar Ontology
type: ConceptScheme

Halo photonics
type: Concept
narrower: StreamLine
preferred label: Halo-Photonik @de

StreamLine
type: Concept
broader: Halo photonics
definition: Lidar de escaneo producido por Halo Photonics. @es
definition: HaloPhotonics公司生产的扫描激光雷达。
definition: Scanning lidar manufactured by HaloPhotonics. @en
definition: Scanner a lungo raggio prodotto da HaloPhotonics. @it
in scheme: IEA Wind Task 32 Wind Lidar Ontology
preferred label: Stromlinie @de
preferred label: Lidar 'StreamLine' @it