IEA Wind Task 32 Wind Lidar Ontology
type: ConceptScheme

Scan geometry
type: Concept
narrower: Static
preferred label: Scan-Geometrie @de
preferred label: 扫描路径 @cn
preferred label: 扫描的几何路径 @cn
preferred label: Geometria di scansionamento @it
preferred label: Geometría de escaneo @es
preferred label: Geometria di scansione @it

Static
type: Concept
broader: Scan geometry
definition: Geometria di scansionamento con il raggio laser fisso nello spazio. @it
definition: Geometría de escaneo lidar de orientaciones fijas del haz lidar. @es
definition: A lidar scan geometry with fixed lidar beam orientations in space.
definition: 测风激光雷达工作时，光束在空间中扫描方向固定的扫描路径 @cn
in scheme: IEA Wind Task 32 Wind Lidar Ontology
preferred label: Statisch @de
preferred label: 静态扫描 @cn
preferred label: Statico @it