IEA Wind Task 32 Wind Lidar Ontology
type: ConceptScheme

Single lidar
type: Concept
narrower: Staring
preferred label: Einzelnes Lidar @de
preferred label: 单个激光雷达 @cn
preferred label: Lidar individual @es
preferred label: Lidar singolo @it

Staring
type: Concept
broader: Single lidar
definition: 光束仅在单一方向扫描的扫描方式。 @cn
definition: Geometría de escaneo que comprende una sola orientación del rayo de medición. @es
definition: Un lidar con orientazione del fascio laser fissa nello spazio. @it
definition: A scan geometry comprised of a single beam orientation.
in scheme: IEA Wind Task 32 Wind Lidar Ontology
preferred label: Glotzend @de
preferred label: 凝视（单向）扫描法 @cn
preferred label: Geometría fija @es
preferred label: Geometria fissa @it